Berat Deniz

Yeni üye
12 Ağu 2020
6
0
0
(16) Bursa
Merhaba arkadaşlar oyunu play store atmak istiyorum ama debug file ları kapamamı istiyor debug file ları kapatmak için for distribution seçeneğini açıyorum  o zamanda ERROR: cmd.exe failed with args /c "D:\unreal project\TheWell 4.25\Intermediate\Android\arm64\gradle\rungradle.bat" :app:assembleRelease hatası alıyorum android studio dan build leyip atmaya çalıştım o zamanda oyunun apk sı bozuldu yardımcı olabilicek var mı şimdiden teşekkürler

Bu da output log kaydım
https://drive.google.com/file/d/1BW3IblG8RbMeteHuZjpOlwxwDnpx0EDl/view?usp=sharing
 
Berat Deniz' Alıntı:
Merhaba arkadaşlar oyunu play store atmak istiyorum ama debug file ları kapamamı istiyor debug file ları kapatmak için for distribution seçeneğini açıyorum  o zamanda ERROR: cmd.exe failed with args /c "D:\unreal project\TheWell 4.25\Intermediate\Android\arm64\gradle\rungradle.bat" :app:assembleRelease hatası alıyorum android studio dan build leyip atmaya çalıştım o zamanda oyunun apk sı bozuldu yardımcı olabilicek var mı şimdiden teşekkürler

Bu da output log kaydım
https://drive.google.com/file/d/1BW3IblG8RbMeteHuZjpOlwxwDnpx0EDl/view?usp=sharing

çözdünmü aynı hatayı alıyorum bende
 
fatih789' Alıntı:
Berat Deniz' Alıntı:
Merhaba arkadaşlar oyunu play store atmak istiyorum ama debug file ları kapamamı istiyor debug file ları kapatmak için for distribution seçeneğini açıyorum  o zamanda ERROR: cmd.exe failed with args /c "D:\unreal project\TheWell 4.25\Intermediate\Android\arm64\gradle\rungradle.bat" :app:assembleRelease hatası alıyorum android studio dan build leyip atmaya çalıştım o zamanda oyunun apk sı bozuldu yardımcı olabilicek var mı şimdiden teşekkürler

Bu da output log kaydım
https://drive.google.com/file/d/1BW3IblG8RbMeteHuZjpOlwxwDnpx0EDl/view?usp=sharing

çözdünmü aynı hatayı alıyorum bende

çözdüm bana output logunu atar mısın
 
Berat Deniz' Alıntı:
fatih789' Alıntı:
resim nasıl atılıyor bilmiyorum hocam nasıl çözdünüz

output logunu bir tane metin belgesine kaydet bana linkini at sıkıntı distribution signing olabilir başka bir yerde de olabilir output logu atabilir isen daha iyi yardımcı olabilirim.

OUTPUT LOGU BASLATTIM HOCAM ATICAM BİRAZDAN KAYDINI


fatih789' Alıntı:
Berat Deniz' Alıntı:
output logunu bir tane metin belgesine kaydet bana linkini at sıkıntı distribution signing olabilir başka bir yerde de olabilir output logu atabilir isen daha iyi yardımcı olabilirim.

OUTPUT LOGU BASLATTIM HOCAM ATICAM BİRAZDAN KAYDINI

UATHelper: Packaging (Android (ETC1)): [proguard] Reading program jar [W:\JavaLibs\play-services-games-11.0.4\libs\play-services-games-11.0.4.jar]
UATHelper: Packaging (Android (ETC1)): [proguard] Reading program jar [W:\JavaLibs\play-services-basement-11.0.4\libs\play-services-basement-11.0.4.jar]
UATHelper: Packaging (Android (ETC1)): [proguard] Reading program jar [W:\JavaLibs\support-core-ui-25.2.0\libs\support-core-ui-25.2.0.jar]
UATHelper: Packaging (Android (ETC1)): [proguard] Reading program jar [W:\JavaLibs\play-services-auth-base-11.0.4\libs\play-services-auth-base-11.0.4.jar]
UATHelper: Packaging (Android (ETC1)): [proguard] Reading program jar [W:\JavaLibs\support-v13-25.2.0\libs\support-v13-25.2.0.jar]
UATHelper: Packaging (Android (ETC1)): [proguard] Reading program jar [W:\JavaLibs\play-services-ads-11.0.4\libs\play-services-ads-11.0.4.jar]
UATHelper: Packaging (Android (ETC1)): [proguard] Reading library jar [C:\NVPACK\2\android-sdk-windows\platforms\android-29\android.jar]
UATHelper: Packaging (Android (ETC1)): BUILD FAILED
UATHelper: Packaging (Android (ETC1)): C:\NVPACK\2\android-sdk-windows\tools\ant\build.xml:871: Can't read [C:\NVPACK\2\android-sdk-windows\platforms\android-29\android.jar] (Can't process class [android/Manifest.class] (Unsupported class version number [52.0] (maximum 51.0, Java 1.7)))
UATHelper: Packaging (Android (ETC1)): Total time: 1 minute 17 seconds
UATHelper: Packaging (Android (ETC1)): ERROR: C:\WINDOWS\system32\cmd.exe failed with args /c "C:/NVPACK/2/apache-ant-1.8.2/bin/ant.bat" release -Djava.source=1.7 -Djava.target=1.7
UATHelper: Packaging (Android (ETC1)): (see C:\Users\ASUS\AppData\Roaming\Unreal Engine\AutomationTool\Logs\C+Program+Files+Epic+Games+UE_4.23\Log.txt for full exception trace)
UATHelper: Packaging (Android (ETC1)): AutomationTool exiting with ExitCode=1 (Error_Unknown)
UATHelper: Packaging (Android (ETC1)): BUILD FAILED
PackagingResults: Error: Unknown Error


Berat Deniz' Alıntı:
fatih789' Alıntı:
resim nasıl atılıyor bilmiyorum hocam nasıl çözdünüz

output logunu bir tane metin belgesine kaydet bana linkini at sıkıntı distribution signing olabilir başka bir yerde de olabilir output logu atabilir isen daha iyi yardımcı olabilirim.

attım hocam
 
fatih789' Alıntı:
Berat Deniz' Alıntı:
output logunu bir tane metin belgesine kaydet bana linkini at sıkıntı distribution signing olabilir başka bir yerde de olabilir output logu atabilir isen daha iyi yardımcı olabilirim.

OUTPUT LOGU BASLATTIM HOCAM ATICAM BİRAZDAN KAYDINI


fatih789' Alıntı:
OUTPUT LOGU BASLATTIM HOCAM ATICAM BİRAZDAN KAYDINI

UATHelper: Packaging (Android (ETC1)):  [proguard] Reading program jar [W:\JavaLibs\play-services-games-11.0.4\libs\play-services-games-11.0.4.jar]
UATHelper: Packaging (Android (ETC1)):  [proguard] Reading program jar [W:\JavaLibs\play-services-basement-11.0.4\libs\play-services-basement-11.0.4.jar]
UATHelper: Packaging (Android (ETC1)):  [proguard] Reading program jar [W:\JavaLibs\support-core-ui-25.2.0\libs\support-core-ui-25.2.0.jar]
UATHelper: Packaging (Android (ETC1)):  [proguard] Reading program jar [W:\JavaLibs\play-services-auth-base-11.0.4\libs\play-services-auth-base-11.0.4.jar]
UATHelper: Packaging (Android (ETC1)):  [proguard] Reading program jar [W:\JavaLibs\support-v13-25.2.0\libs\support-v13-25.2.0.jar]
UATHelper: Packaging (Android (ETC1)):  [proguard] Reading program jar [W:\JavaLibs\play-services-ads-11.0.4\libs\play-services-ads-11.0.4.jar]
UATHelper: Packaging (Android (ETC1)):  [proguard] Reading library jar [C:\NVPACK\2\android-sdk-windows\platforms\android-29\android.jar]
UATHelper: Packaging (Android (ETC1)): BUILD FAILED
UATHelper: Packaging (Android (ETC1)): C:\NVPACK\2\android-sdk-windows\tools\ant\build.xml:871: Can't read [C:\NVPACK\2\android-sdk-windows\platforms\android-29\android.jar] (Can't process class [android/Manifest.class] (Unsupported class version number [52.0] (maximum 51.0, Java 1.7)))
UATHelper: Packaging (Android (ETC1)): Total time: 1 minute 17 seconds
UATHelper: Packaging (Android (ETC1)): ERROR: C:\WINDOWS\system32\cmd.exe failed with args /c "C:/NVPACK/2/apache-ant-1.8.2/bin/ant.bat" release -Djava.source=1.7 -Djava.target=1.7
UATHelper: Packaging (Android (ETC1)):        (see C:\Users\ASUS\AppData\Roaming\Unreal Engine\AutomationTool\Logs\C+Program+Files+Epic+Games+UE_4.23\Log.txt for full exception trace)
UATHelper: Packaging (Android (ETC1)): AutomationTool exiting with ExitCode=1 (Error_Unknown)
UATHelper: Packaging (Android (ETC1)): BUILD FAILED
PackagingResults: Error: Unknown Error


Berat Deniz' Alıntı:
output logunu bir tane metin belgesine kaydet bana linkini at sıkıntı distribution signing olabilir başka bir yerde de olabilir output logu atabilir isen daha iyi yardımcı olabilirim.

attım hocam



team viewer ın var mı ? benim aldığımdan birazdaha farklı bi hata bu nvpack yolunu okuyamıyor kurulum sorunu yaşıyor olabilirsin.
 
Berat Deniz' Alıntı:
fatih789' Alıntı:
OUTPUT LOGU BASLATTIM HOCAM ATICAM BİRAZDAN KAYDINI



UATHelper: Packaging (Android (ETC1)):  [proguard] Reading program jar [W:\JavaLibs\play-services-games-11.0.4\libs\play-services-games-11.0.4.jar]
UATHelper: Packaging (Android (ETC1)):  [proguard] Reading program jar [W:\JavaLibs\play-services-basement-11.0.4\libs\play-services-basement-11.0.4.jar]
UATHelper: Packaging (Android (ETC1)):  [proguard] Reading program jar [W:\JavaLibs\support-core-ui-25.2.0\libs\support-core-ui-25.2.0.jar]
UATHelper: Packaging (Android (ETC1)):  [proguard] Reading program jar [W:\JavaLibs\play-services-auth-base-11.0.4\libs\play-services-auth-base-11.0.4.jar]
UATHelper: Packaging (Android (ETC1)):  [proguard] Reading program jar [W:\JavaLibs\support-v13-25.2.0\libs\support-v13-25.2.0.jar]
UATHelper: Packaging (Android (ETC1)):  [proguard] Reading program jar [W:\JavaLibs\play-services-ads-11.0.4\libs\play-services-ads-11.0.4.jar]
UATHelper: Packaging (Android (ETC1)):  [proguard] Reading library jar [C:\NVPACK\2\android-sdk-windows\platforms\android-29\android.jar]
UATHelper: Packaging (Android (ETC1)): BUILD FAILED
UATHelper: Packaging (Android (ETC1)): C:\NVPACK\2\android-sdk-windows\tools\ant\build.xml:871: Can't read [C:\NVPACK\2\android-sdk-windows\platforms\android-29\android.jar] (Can't process class [android/Manifest.class] (Unsupported class version number [52.0] (maximum 51.0, Java 1.7)))
UATHelper: Packaging (Android (ETC1)): Total time: 1 minute 17 seconds
UATHelper: Packaging (Android (ETC1)): ERROR: C:\WINDOWS\system32\cmd.exe failed with args /c "C:/NVPACK/2/apache-ant-1.8.2/bin/ant.bat" release -Djava.source=1.7 -Djava.target=1.7
UATHelper: Packaging (Android (ETC1)):        (see C:\Users\ASUS\AppData\Roaming\Unreal Engine\AutomationTool\Logs\C+Program+Files+Epic+Games+UE_4.23\Log.txt for full exception trace)
UATHelper: Packaging (Android (ETC1)): AutomationTool exiting with ExitCode=1 (Error_Unknown)
UATHelper: Packaging (Android (ETC1)): BUILD FAILED
PackagingResults: Error: Unknown Error



attım hocam



team viewer ın var mı ?




2dk yüklüyom hocam


Berat Deniz' Alıntı:
team viewer ın var mı ? benim aldığımdan birazdaha farklı bi hata bu nvpack yolunu okuyamıyor kurulum sorunu yaşıyor olabilirsin.
team vıver bağlanın hocam
ıd :   291 142 584
şifre: nh89m2
 
UATHelper: Packaging (Android (Multi:ASTC,DXT,ETC2)): FAILURE: Build failed with an exception.
UATHelper: Packaging (Android (Multi:ASTC,DXT,ETC2)): * What went wrong:
UATHelper: Packaging (Android (Multi:ASTC,DXT,ETC2)): Could not initialize class org.codehaus.groovy.reflection.ReflectionCache
UATHelper: Packaging (Android (Multi:ASTC,DXT,ETC2)): * Try:
UATHelper: Packaging (Android (Multi:ASTC,DXT,ETC2)): Run with --stacktrace option to get the stack trace. Run with --info or --debug option to get more log output. Run with --scan to get full insights.
UATHelper: Packaging (Android (Multi:ASTC,DXT,ETC2)): * Get more help at https://help.gradle.org
UATHelper: Packaging (Android (Multi:ASTC,DXT,ETC2)): BU�LD FAILED in 8s
UATHelper: Packaging (Android (Multi:ASTC,DXT,ETC2)): ERROR: cmd.exe failed with args /c "C:\Users\BARAT\Documents\Unreal Projects\MyProject\Intermediate\Android\arm64\gradle\rungradle.bat" :app:assembleRelease
UATHelper: Packaging (Android (Multi:ASTC,DXT,ETC2)):        (see C:\Users\BARAT\AppData\Roaming\Unreal Engine\AutomationTool\Logs\C+Program+Files+Epic+Games+UE_4.26\Log.txt for full exception trace)
UATHelper: Packaging (Android (Multi:ASTC,DXT,ETC2)): AutomationTool exiting with ExitCode=1 (Error_Unknown)
UATHelper: Packaging (Android (Multi:ASTC,DXT,ETC2)): BUILD FAILED
PackagingResults: Error: Unknown Error
LogSlate: Only BGRA pngs, bmps or icos are supported in by External Image Picker

bende aynı hatayı alıyorum nasıl çözdün hocam