Selam arkadaşlar projemi package ettiğimde bir hata ile karşılaştım hatanın ne olduğu hakkında pek bir şey anlamış değilim.Yorumlarınızı bekliyorum.
Logun hata kısmını aşağıya bırakıyorum.
Logun hata kısmını aşağıya bırakıyorum.
Kod:
UATHelper: Packaging (Windows (64-bit)): Cook: LogOnline:Display: OSS: FOnlineSubsystemNull::Shutdown()
UATHelper: Packaging (Windows (64-bit)): Cook: LogOnline:Display: OSS: FOnlineAsyncTaskManager::Stop() ActiveTask:0000000000000000 Tasks[0/0]
UATHelper: Packaging (Windows (64-bit)): Cook: LogOnline:Display: OSS: FOnlineAsyncTaskManager::Exit() started
UATHelper: Packaging (Windows (64-bit)): Cook: LogOnline:Display: OSS: FOnlineAsyncTaskManager::Exit() finished
UATHelper: Packaging (Windows (64-bit)): Cook: LogOnline:Display: Unloading online subsystem: STEAM
UATHelper: Packaging (Windows (64-bit)): Cook: LogOnline:Display: Unloading online subsystem: NULL
UATHelper: Packaging (Windows (64-bit)): CommandUtils.Run: Run: Took 6744,3014596s to run UE4Editor-Cmd.exe, ExitCode=1
UATHelper: Packaging (Windows (64-bit)): Project.Cook: Cook failed. Deleting cooked data.
UATHelper: Packaging (Windows (64-bit)): Program.Main: ERROR: AutomationTool terminated with exception: AutomationTool.AutomationException: Cook failed. ---> AutomationTool.CommandletException: BUILD FAILED: Failed while running Cook for C:\Users\NAZIM\Documents\Unreal Projects\oyunum1 4.16\oyunum1.uproject; see log C:\Users\NAZIM\AppData\Roaming\Unreal Engi
ne\AutomationTool\Logs\C+Program+Files+Epic+Games+UE_4.16\Cook-2017.08.23-08.38.19.txt
UATHelper: Packaging (Windows (64-bit)): konum: AutomationTool.CommandUtils.RunCommandlet(FileReference ProjectName, String UE4Exe, String Commandlet, String Parameters)
UATHelper: Packaging (Windows (64-bit)): konum: AutomationTool.CommandUtils.CookCommandlet(FileReference ProjectName, String UE4Exe, String[] Maps, String[] Dirs, String InternationalizationPreset, String[] CulturesToCook, String TargetPlatform, String Parameters)
UATHelper: Packaging (Windows (64-bit)): konum: Project.Cook(ProjectParams Params)
UATHelper: Packaging (Windows (64-bit)): --- İç özel durum yığını izlemesinin sonu ---
UATHelper: Packaging (Windows (64-bit)): konum: Project.Cook(ProjectParams Params)
UATHelper: Packaging (Windows (64-bit)): konum: BuildCookRun.DoBuildCookRun(ProjectParams Params)
UATHelper: Packaging (Windows (64-bit)): konum: BuildCookRun.ExecuteBuild()
UATHelper: Packaging (Windows (64-bit)): konum: AutomationTool.BuildCommand.Execute()
UATHelper: Packaging (Windows (64-bit)): konum: AutomationTool.Automation.Execute(List`1 CommandsToExecute, CaselessDictionary`1 Commands)
UATHelper: Packaging (Windows (64-bit)): konum: AutomationTool.Automation.Process(String[] Arguments)
UATHelper: Packaging (Windows (64-bit)): konum: AutomationTool.Program.MainProc(Object Param)
UATHelper: Packaging (Windows (64-bit)): konum: AutomationTool.InternalUtils.RunSingleInstance(Func`2 Main, Object Param)
UATHelper: Packaging (Windows (64-bit)): konum: AutomationTool.Program.Main()
UATHelper: Packaging (Windows (64-bit)): Program.Main: AutomationTool exiting with ExitCode=25 (Error_UnknownCookFailure)
UATHelper: Packaging (Windows (64-bit)): BUILD FAILED
PackagingResults:Error: Error Unknown Cook Failure