metars' Alıntı:
LetsGoPop' Alıntı:
usb yi z yaptıp ve nvdia android worksu yeniden kurdum farklı bir sürücüye ancak hayla aynı hatayı alıyorum
D:\NVPACK\android-sdk-windows\tools\ant\build.xml:1135: The following error occurred while executing this line:
UATHelper: Packaging (Android (All)): D:\NVPACK\android-sdk-windows\tools\ant\build.xml:1147: D:\unreal projr\denemeproje\Intermediate\Android\APK\eniste (Sistem belirtilen dosyay? bulam?yor)
UATHelper: Packaging (Android (All)): Total time: 50 seconds
UATHelper: Packaging (Android (All)): Program.Main: ERROR: AutomationTool terminated with exception: System.IO.FileNotFoundException: 'D:\unreal projr\denemeproje\Intermediate/Android/APK/bin/denemeproje-release.apk' dosyası bulunamadı.
UATHelper: Packaging (Android (All)): Dosya adı: 'D:\unreal projr\denemeproje\Intermediate/Android/APK/bin/denemeproje-release.apk'
ve bunu deme nedeni ne ben relase-apk diye birşey belirtmedim
bide project settingste nerelerin değişmesi bunu verir olmadı hepsinin videosunu yada fotoğrafını atayım .
"D:\unreal projr" klasör adını türkçe karakter olmayacak şekilde ve boşluksuz olarak değiştirip tekrar denermisin (özel karakterde olmasın ?*/ v.b.)
kusura bakma cevap yazamadım evde yoktum yeni geldim ve denedim dosya adını unrealp yapmama rağman yinede hata alıyorm
BUILD FAILED
UATHelper: Packaging (Android (All)): D:\NVPACK\android-sdk-windows\tools\ant\build.xml:1135: The following error occurred while executing this line:
UATHelper: Packaging (Android (All)): D:\NVPACK\android-sdk-windows\tools\ant\build.xml:1147: D:\unrealp\denemeproje\Intermediate\Android\APK\eniste (Sistem belirtilen dosyay? bulam?yor)
UATHelper: Packaging (Android (All)): Total time: 50 seconds
UATHelper: Packaging (Android (All)): Program.Main: ERROR: AutomationTool terminated with exception: System.IO.FileNotFoundException: 'D:\unrealp\denemeproje\Intermediate/Android/APK/bin/denemeproje-release.apk' dosyası bulunamadı.
UATHelper: Packaging (Android (All)): Dosya adı: 'D:\unrealp\denemeproje\Intermediate/Android/APK/bin/denemeproje-release.apk'
UATHelper: Packaging (Android (All)): konum: System.IO.__Error.WinIOError(Int32 errorCode, String maybeFullPath)
UATHelper: Packaging (Android (All)): konum: System.IO.File.InternalCopy(String sourceFileName, String destFileName, Boolean overwrite, Boolean checkHost)
UATHelper: Packaging (Android (All)): konum: UnrealBuildTool.UEDeployAndroid.MakeApk(AndroidToolChain ToolChain, String ProjectName, String ProjectDirectory, String OutputPath, String EngineDirectory, Boolean bForDistribution, String CookFlavor, Boolean bMakeSeparateApks, Boolean bIncrementalPackage, Boolean bDisallowPackagingDataInApk)
UATHelper: Packaging (Android (All)): konum: UnrealBuildTool.UEDeployAndroid.PrepForUATPackageOrDeploy(FileReference ProjectFile, String ProjectName, String ProjectDirectory, String ExecutablePath, String EngineDirectory, Boolean bForDistribution, String CookFlavor, Boolean bIsDataDeploy)
UATHelper: Packaging (Android (All)): konum: AndroidPlatform.Package(ProjectParams Params, DeploymentContext SC, Int32 WorkingCL)
UATHelper: Packaging (Android (All)): konum: Project.Package(ProjectParams Params, Int32 WorkingCL)
UATHelper: Packaging (Android (All)): konum: BuildCookRun.DoBuildCookRun(ProjectParams Params)
UATHelper: Packaging (Android (All)): konum: BuildCookRun.ExecuteBuild()
UATHelper: Packaging (Android (All)): konum: AutomationTool.BuildCommand.Execute()
UATHelper: Packaging (Android (All)): konum: AutomationTool.Automation.Execute(List`1 CommandsToExecute, CaselessDictionary`1 Commands)
UATHelper: Packaging (Android (All)): konum: AutomationTool.Automation.Process(String[] Arguments)
UATHelper: Packaging (Android (All)): konum: AutomationTool.Program.MainProc(Object Param)
UATHelper: Packaging (Android (All)): konum: AutomationTool.InternalUtils.RunSingleInstance(Func`2 Main, Object Param)
UATHelper: Packaging (Android (All)): konum: AutomationTool.Program.Main()
UATHelper: Packaging (Android (All)): Program.Main: AutomationTool exiting with ExitCode=1 (Error_Unknown)
UATHelper: Packaging (Android (All)): BUILD FAILED
PackagingResults:Error: Error Unknown Error